{"text_format":"1","workbook":"xlsx","n_sheets":15,"sheets":["Intro","Dashboard results","Project","Technology","Market ","Pathway definition and results","Data - technical","Data - economic","Data - environmental","Data - general","1. Pathway 1","2. Pathway 2","3. Pathway 3","4. Pathway 4","Dropdown list"],"not_rendered":{"charts":1,"images":26,"macros":1,"external_links":1,"defined_names":40,"comments":9,"pivot_tables":0},"unopened":[],"bounds":{"document_bytes":16777216,"sheet_cells":100000,"rows_first":2000,"rows_last":500,"rows_between":2000,"halvings":0,"cell_chars":16384,"cell_head_chars":4096},"cells_cut":0,"cells_raw":0,"read":"whole","date_system":"1900"}

{"sheet":"Intro","index":0,"n_rows":52,"n_cols":4,"rows_kept":52,"cut":false,"hidden":false,"merged":[[10,1,10,23],[7,1,7,10],[45,1,45,11],[51,1,51,14]]}
[]
[]
[]
[]
[null,"Introduction "]
[]
[null,"Background and purpose of the template "]
[null,"The goal of the Moonshot program is to support projects that aim at providing solutions that help the (chemical) industry in Flanders to become CO2 neutral by 2050. \n\nThe goal of this template is to provide guidance in the valorisation and sustainability assessment of Moonshot projects taking the overall Moonshot objective and specific MOT KPIs into account. \n\nThe template and guidelines are based on principles of TEA and LCA, however, are too limited to be used as a full TEA and LCA. The template is obliged during the execution of the approved Moonshot projects and is one of the deliverables that need to be submitted to Vlaio. Mid-term the project, a meeting with the advisory board members needs to be organized to discuss the results of the sustainability assessment. \n\nThe goals are the following: \nI.\tTo have a substantiated estimate of the economic and climate change impacts with the aim to identify the hot-spots (i.e. understand where the impact is coming from) and with these to update research targets from the proposal phase and define the next steps towards implementation (i.e. technology roadmap and follow-up trajectory); \nII.\tTo compare the economic and climate change impact with state-of-the-art and emerging technologies; \nIII.\tTo understand the contribution of a project to the specific MOT goals and KPIs;\nIV.\tTo specify what is required for a successful implementation. \n\nDetailed guidelines are available in the document titled \"methodological framework for the sustainability assessment of MOONSHOT initiatives\"."]
[]
[null,"Template developers"]
[null,"The template and framework are developed by a consortium led by VITO and subcontractors Deloitte, Antwerp University, KU Leuven and Ghent University. \nThe template and accompanying sustainability framework are commissioned by Vlaio. "]
[]
[null,"Contact information"]
[null,"For questions related to the template, please use one of the following e-mail addresses: "]
[null,"- Helpdesk - moonshot.sustainabilityframework@vito.be"]
[null,"- Catalisti - moonshot@catalisti.be"]
[]
[null,"Legend"]
[]
[null,"Worksheets"]
[null,"Name","Description ","Examples"]
[null,"Intro","Information on background and purpose of template, overview of worksheets and some general agreements. "]
[null,"Dashboard results","A summary of the main results is automatically generated in this dashboard based on the calculations in the other worksheets. "]
[null,"Project","Add general administrative information on your project.","Title, budget, partners,… "]
[null,"Technology","Describe your process, the benchmark technologies and the goals and scope of the sustainability assessment. ","Benchmark technologies, advantages of your technology, fit with the value chain and interested companies. "]
[null,"Market ","Describe market information for your targetted product(s) and an overview of relevant policy documents.","Price, production volume, CAGR, applications, link with roadmaps and regulation, link with MOT objective, link with other projects, interaction with companies and valoriation objectives. "]
[null,"Pathway definition and results","On this worksheet an overview of different pathways can be added. Furthermore, (sub)scenarios can be defined that allow to quickly see the impact of changes in defined parameters. Also, an overview of your main findings from the sustainability assessment is added here. ","Overview of the pathways, Impact availability of residue heat, subsidies, scale, summary of the results"]
[null,"Data - technical ","Add all technical input parameters for your mass and energy balance calculations, including the references. Calculations are performed on the pathway worksheet.","Yield, energy use, catalyst use, material choices,… "]
[null,"Data - economic","Add all economic input parameters for your calculations of the economic indicators, including the references. Calculations are performed on the pathway worksheet.","CAPEX, OPEX, revenues"]
[null,"Data - environmental ","Add all environmental input parameters for your calculations of the environmental impact indicator, including the references (mainly characterization factors). Calculations are performed on the pathway worksheet.","CO2 impact of electricity in kg CO2-equivalent per kWh"]
{"$rows_left_out":23}
{"sheet":"Dashboard results","index":1,"n_rows":128,"n_cols":11,"rows_kept":128,"cut":false,"hidden":false,"merged":[[21,2,21,3],[40,2,40,3],[42,3,46,3],[11,5,11,7],[11,10,14,12],[13,5,13,7],[15,5,15,7],[17,5,17,7],[42,10,46,12],[1,2,1,13],[3,2,3,3],[5,5,5,7],[7,5,7,7],[9,5,9,7],[107,3,111,3],[115,3,119,3],[107,5,111,7],[113,5,113,7],[115,5,119,7],[48,10,48,12],[50,10,55,12],[79,3,83,3],[87,3,91,3],[85,5,85,7],[79,5,83,7],[87,5,91,7],[50,3,55,3]]}
[]
[null,null,"Disclaimer: This dashboard displays an overview of important data, each time referring to the different input worksheets. Data should not be entered in this worksheet by the registrants."]
[]
[null,null,"General project information"]
[]
[null,null,null,{"$f":"Project!$B$6","v":"Project acronym"},null,{"$f":"IF(Project!$C$6=0,\"\",Project!$C$6)","v":""},null,null,null,{"$f":"Technology!$B$6","v":"Targeted product(s)"},{"$f":"IF(Technology!$C$6=0,\"\",Technology!$C$6)","v":""}]
[]
[null,null,null,{"$f":"Project!$B$9","v":"Start date"},null,{"$f":"IF(Project!$C$9=0,\"\",Project!$C$9)","v":""},null,null,null,{"$f":"Technology!$B$11","v":"Current TRL "},{"$f":"IF(Technology!$C$11=0,\"\",Technology!$C$11)","v":""}]
[]
[null,null,null,{"$f":"Project!$B$10","v":"Project duration (months)"},null,{"$f":"IF(Project!$C$10=0,\"\",Project!$C$10)","v":""},null,null,null,{"$f":"Technology!$B$32","v":"Functional unit (FU)"},{"$f":"IF(Technology!$C$32=0,\"\",Technology!$C$32)","v":""}]
[]
[null,null,null,{"$f":"Project!$B$11","v":"Total budget (€)"},null,{"$f":"IF(Project!$C$11=0,\"\",Project!$C$11)","v":""},null,null,null,{"$f":"Technology!$B$8","v":"Process description"},{"$f":"IF(Technology!$B$9=0,\"\",Technology!$B$9)","v":""}]
[]
[null,null,null,{"$f":"Project!$B$12","v":"Total number of person-months"},null,{"$f":"IF(Project!$C$12=0,\"\",Project!$C$12)","v":""}]
[]
[null,null,null,{"$f":"Project!$B$13","v":"Lead partner (coordinator)"},null,{"$f":"IF(Project!$C$13=0,\"\",Project!$C$13)","v":""}]
[null,null,null,null,null,null,null,null,null,{"$f":"Technology!$B$23","v":"Geographical scope"},{"$f":"IF(Technology!$C$23=0,\"\",Technology!$C$23)","v":"Flanders"}]
[null,null,null,{"$f":"Project!$B$14","v":"Other consortium partners"},null,{"$f":"IF(Project!$C$14=0,\"\",Project!$C$14)","v":""}]
[]
[]
[]
[null,null,"Selected Pathway"]
[]
[null,null,null,"Select the desired pathway that needs to be shown in the dashboard"]
[null,null,null,"1. Pathway 1 "]
[]
[]
[]
[null,null,"Detailed Technical indicators by Pathway"]
[]
{"$rows_left_out":99}
{"sheet":"Project","index":2,"n_rows":19,"n_cols":2,"rows_kept":19,"cut":false,"hidden":false,"merged":[]}
[]
[]
[]
[null,"Project sheet"]
[]
[null,"Project acronym"]
[null,"Full title"]
[null,"Project number"]
[null,"Start date"]
[null,"Project duration (months)"]
[null,"Total budget (€)"]
[null,"Total number of person-months"]
[null,"Lead partner (coordinator)"]
[null,"Other consortium partners"]
[null,"Contact information coordinator"]
[]
[]
[null,"Version "]
[null,"Date"]

{"sheet":"Technology","index":3,"n_rows":38,"n_cols":8,"rows_kept":38,"cut":false,"hidden":false,"merged":[[15,4,15,6],[16,4,16,6],[31,2,31,10],[38,1,38,10],[34,1,34,10],[29,2,29,10],[5,2,5,10],[8,1,8,10],[10,2,10,10],[22,2,22,10],[24,2,24,10],[20,1,20,10],[13,4,13,6],[14,7,14,10],[15,7,15,10],[16,7,16,10],[14,4,14,6],[13,7,13,10]]}
[]
[]
[]
[null,"Technology description "]
[]
[null,"Targeted product(s)"]
[]
[null,"Process description"]
[]
[]
[null,"Current TRL "]
[]
[null,"Benchmark technologies"]
[null,"Benchmark process","TRL","Climate change impact (ton CO2eq/FU)","Description",null,null,"Position of new technology compared to benchmark process"]
[]
[]
[]
[]
[null,"Purpose of the sustainability assessment"]
[null,"Describe the specific purpose that you have defined for the sustainability impact calculation. "]
[]
[]
[null,"Geographical scope","Flanders"]
[]
[null,"Temporal scope","Replace with current year unless a different choice is made. In the latter case an explanation needs to be added as well. "]
[]
[]
[null,"System boundaries"]
[null,"Select option below","Explain choice"]
[]
{"$rows_left_out":9}
{"sheet":"Market ","index":4,"n_rows":25,"n_cols":3,"rows_kept":25,"cut":false,"hidden":false,"merged":[[6,3,6,9]]}
[]
[]
[]
[null,"Market description"]
[]
[null,"How does the current market of your targeted product look like? "]
[null,"Targeted product 1"]
[null,"Global production (ton/yr)"]
[null,"Belgian production (ton/yr)"]
[null,"Global demand (ton/yr) "]
[null,"Targeted market share "]
[null,"CAGR (%)"]
[null,"Main market players"]
[null,"Main market players Flanders"]
[null,"Price (€/ton)"]
[null,"Main application(s)"]
[null,"Targeted application(s)"]
[null,"Main production technology"]
[null,"CO2 footprint fossil-based/current main production route (ton CO2eq/ton product)"]
[null,"Varia"]
[]
[]
[null,"Relevant regulations/Policy measures"]
[null,"Which regulations or policy measures can impact (both positive or negative) your innovation?  "]
[null,"Regulation/Policy measure","Description/relevancy for the project"]

{"sheet":"Pathway definition and results","index":5,"n_rows":82,"n_cols":8,"rows_kept":82,"cut":false,"hidden":false,"merged":[[74,2,74,8],[78,2,78,8],[82,2,82,8],[4,3,4,8],[5,3,5,8],[6,3,6,8],[7,3,7,8],[66,2,66,8],[2,2,2,3],[11,2,11,3],[19,2,19,3],[26,2,26,3],[70,2,70,8]]}
[]
[]
[null,null,"Pathway definition and results"]
[]
[null,null,"Pathway 1 "]
[null,null,"Pathway 2"]
[null,null,"Pathway 3"]
[null,null,"Pathway 4 "]
[]
[]
[]
[null,null,"Scale"]
[null,null,"Parameter","Unit",{"$f":"\"1.\" & \" \" & C5","v":"1. Pathway 1 "},{"$f":"\"2.\" & \" \" & C6","v":"2. Pathway 2"},{"$f":"\"3.\" & \" \" & C7","v":"3. Pathway 3"},{"$f":"\"4.\" & \" \" & C8","v":"4. Pathway 4 "}]
[null,null,"Feedstock x input ","ton/yr"]
[null,null,"Production x ","ton/yr"]
[null,null,"Annual operating time","hr/yr",8000,8000,8000,8000]
[]
[]
[]
[null,null,"What-if parameter"]
[null,null,"Parameter",null,{"$f":"E13","v":"1. Pathway 1 "},{"$f":"F13","v":"2. Pathway 2"},{"$f":"G13","v":"3. Pathway 3"},{"$f":"H13","v":"4. Pathway 4 "}]
[null,null,"Subsidies",null,0,0,0,0]
[]
[]
[]
[]
[null,null,"Summary main results "]
[null,null,"Parameter","Unit",{"$f":"E13","v":"1. Pathway 1 "},{"$f":"F13","v":"2. Pathway 2"},{"$f":"G13","v":"3. Pathway 3"},{"$f":"H13","v":"4. Pathway 4 "}]
[null,null,"Input"]
[null,null,"Feedstock ","ton/yr"]
{"$rows_left_out":53}
{"sheet":"Data - technical","index":6,"n_rows":129,"n_cols":12,"rows_kept":129,"cut":false,"hidden":false,"merged":[]}
[]
[]
[]
[null,"Technical data inventory"]
[]
[]
[]
[null,null,null,"Parameter","Unit","Indicative value","Range","Data type",{"$f":"'Pathway definition and results'!E13","v":"1. Pathway 1 "},{"$f":"'Pathway definition and results'!F13","v":"2. Pathway 2"},{"$f":"'Pathway definition and results'!G13","v":"3. Pathway 3"},{"$f":"'Pathway definition and results'!H13","v":"4. Pathway 4 "}]
[null,"Raw material extraction/feedstock"]
[null,"Feedstock x ","Mass In","Scale","ton/yr"]
[null,null,null,"Dry matter","%"]
[null,null,null,"Composition"]
[null,null,null,"> x "]
[null,null,null,"> x "]
[]
[]
[null,"Technology x ","Mass In"]
[null,null,"Mass Out"]
[null,null,"Energy"]
[null,null,"Process"]
[null,null,"Equipment"]
[null,null,"Waste"]
[null,null,"Emissions"]
[null,null,"Transport"]
[]
[]
[null,"Pre-processing"]
[null,"Technology x","Mass In"]
[null,null,"Mass Out"]
[null,null,"Energy"]
{"$rows_left_out":100}
{"sheet":"Data - economic","index":7,"n_rows":138,"n_cols":12,"rows_kept":138,"cut":false,"hidden":false,"merged":[]}
[]
[]
[]
[null,"Economic data inventory"]
[]
[]
[]
[null,null,null,"Parameter","Unit","Indicative value","Range","Data type",{"$f":"'Pathway definition and results'!E13","v":"1. Pathway 1 "},{"$f":"'Pathway definition and results'!F13","v":"2. Pathway 2"},{"$f":"'Pathway definition and results'!G13","v":"3. Pathway 3"},{"$f":"'Pathway definition and results'!H13","v":"4. Pathway 4 "}]
[null,"Financial"]
[null,null,null,"Nominal discount rate","%",0.25,"10-30",6]
[null,null,null,"Real discount rate","%",{"$f":"(F10-F15)/(1+F15)","v":0.22549019607843138}]
[null,null,null,"Equity (EV)","%",0.2,null,6]
[null,null,null,"Debt (VV)","%",{"$f":"1-F12","v":0.8}]
[null,null,null,"Intrest rate (loan)","%",0.05,null,6]
[null,null,null,"Inflation rate","%",0.02,null,6]
[null,null,null,"WACC","%",{"$f":"(F11*F12)+(F13*(1-F17)*F14)","v":7.509803921568628E-2}]
[null,null,null,"Corporate tax rate Belgium","%",0.25,null,6]
[null,null,null,"Economic Lifetime/Evaluation period","yr",15,"10-20",6]
[null,"General capital costs"]
[null,null,"Lang factor","Solid processing plant","-",4,"-",6]
[null,null,null,"Solid-fluid processing plant","-",4.3,"-",6]
[null,null,null,"Fluid processing plant ","-",5,"-",6]
[]
[null,null,"Ratio factors","Installation","%direct equipment",0.39,"39-47",6]
[null,null,null,"Instrumentation and controls","%direct equipment",0.26,"18-36",6]
[null,null,null,"Piping","%direct equipment",0.31,"16-68",6]
[null,null,null,"Electrical systems","%direct equipment",0.1,"10-11",6]
[null,null,null,"Buildings","%direct equipment",0.28999999999999998,"18-29",6]
[null,null,null,"Yard improvements","%direct equipment",0.12,"10-15",6]
[null,null,null,"Service facilities","%direct equipment",0.55000000000000004,"40-70",6]
{"$rows_left_out":109}
{"sheet":"Data - environmental","index":8,"n_rows":64,"n_cols":12,"rows_kept":64,"cut":false,"hidden":false,"merged":[]}
[]
[]
[]
[null,"Environmental data inventory"]
[]
[]
[]
[null,null,null,"Parameter","Unit","Indicative value","Range","Data type",{"$f":"'Pathway definition and results'!E13","v":"1. Pathway 1 "},{"$f":"'Pathway definition and results'!F13","v":"2. Pathway 2"},{"$f":"'Pathway definition and results'!G13","v":"3. Pathway 3"},{"$f":"'Pathway definition and results'!H13","v":"4. Pathway 4 "}]
[null,"Characterization factors"]
[null,"Greenhouse gases (GHG)",null,"CO2 (fossil-origin)","kg CO2eq/kg CO2",1,"-",6]
[null,null,null,"CO2 (biogenic origin)","kg CO2eq/kg CO2",0,"-",6]
[null,null,null,"CH4 ","kg CO2eq/kg CH4",28,"25-34",6]
[null,null,null,"N2O","kg CO2eq/kg N2O",265,"-",6]
[null,null,null,"HCFC-141b","kg CO2eq/kg HCFC-141b",782,"-",6]
[null,null,null,"HFC-134a","kg CO2eq/kg HFC-134a",1300,"-",6]
[null,null,null,"HCFC-22","kg CO2eq/kg HCFC-22",1760,"-",6]
[null,null,null,"HCFC-142b","kg CO2eq/kg HCFC-142b",1980,"-",6]
[null,null,null,"CFC-11","kg CO2eq/kg CFC-11",4660,"-",6]
[null,null,null,"CFC-12","kg CO2eq/kg CFC-12",10200,"-",6]
[null,null,null,"SF6","kg CO2eq/kg SF6",23500,"-",6]
[]
[]
[null,"Impact factors"]
[null,"Energy",null,"Electricity BE - grid (2018) - medium voltage","kg CO2eq/kWh",0.25,"-",6]
[null,null,null,"Electricity BE - grid (2050)","kg CO2eq/kWh",null,"-",6]
[null,null,null,"Electricity - renewables (NO) - medium voltage","kg CO2eq/kWh",1.7600000000000001E-2,"-",6]
[null,null,null,"Diesel - average blend ","kg CO2eq/kg",0.73364436,"-",6]
[null,null,null,"Diesel - direct emissions from combustion ","kg CO2eq/kg",{"$f":"3015.65461610738/1000","v":3.0156546161073803},"-",6]
[null,null,null,"Natural gas (production)","kg CO2eq/kWh",3.347E-2,"-",6]
[null,null,null,"Natural gas - direct emissions from combustion ","kg CO2eq/kWh",0.2,"-",6]
{"$rows_left_out":35}
{"sheet":"Data - general","index":9,"n_rows":34,"n_cols":4,"rows_kept":34,"cut":false,"hidden":false,"merged":[]}
[]
[]
[]
[null,"General data"]
[]
[]
[]
[null,"CEPCI"]
[]
[null,null,"Year","CEPCI"]
[null,null,2013,567.29999999999995]
[null,null,2014,576.1]
[null,null,2015,556.79999999999995]
[null,null,2016,541.70000000000005]
[null,null,2017,567.5]
[null,null,2018,603.1]
[null,null,2019,607.5]
[null,null,2020,596.20000000000005]
[null,null,2021,708]
[null,null,2022,816]
[]
[null,"General conversion factors"]
[null,"This is just an example. The table can be further extended with other conversion factors that are required for the calculations. "]
[]
[null,"Factor","Value"]
[null,"MWh to kWh",1000]
[]
[]
[]
[null,"General technical parameters"]
{"$rows_left_out":5}
{"sheet":"1. Pathway 1","index":10,"n_rows":207,"n_cols":35,"rows_kept":207,"cut":false,"hidden":false,"merged":[[77,4,77,34]]}
[]
[]
[]
[null,{"$f":"'Pathway definition and results'!E13","v":"1. Pathway 1 "}]
[]
[null,"PFD"]
[]
[]
[]
[]
[]
[]
[]
[]
[]
[]
[]
[]
[]
[]
[]
[]
[]
[]
[]
[]
[]
[]
[]
[null,"Technical "]
{"$rows_left_out":178}
{"sheet":"2. Pathway 2","index":11,"n_rows":207,"n_cols":35,"rows_kept":207,"cut":false,"hidden":true,"merged":[[77,4,77,34]]}
[]
[]
[]
[null,{"$f":"'Pathway definition and results'!F13","v":"2. Pathway 2"}]
[]
[null,"PFD"]
[]
[]
[]
[]
[]
[]
[]
[]
[]
[]
[]
[]
[]
[]
[]
[]
[]
[]
[]
[]
[]
[]
[]
[null,"Technical "]
{"$rows_left_out":178}
{"sheet":"3. Pathway 3","index":12,"n_rows":207,"n_cols":35,"rows_kept":207,"cut":false,"hidden":true,"merged":[[77,4,77,34]]}
[]
[]
[]
[null,{"$f":"'Pathway definition and results'!G13","v":"3. Pathway 3"}]
[]
[null,"PFD"]
[]
[]
[]
[]
[]
[]
[]
[]
[]
[]
[]
[]
[]
[]
[]
[]
[]
[]
[]
[]
[]
[]
[]
[null,"Technical "]
{"$rows_left_out":178}
{"sheet":"4. Pathway 4","index":13,"n_rows":207,"n_cols":35,"rows_kept":207,"cut":false,"hidden":true,"merged":[[77,4,77,34]]}
[]
[]
[]
[null,{"$f":"'Pathway definition and results'!H13","v":"4. Pathway 4 "}]
[]
[null,"PFD"]
[]
[]
[]
[]
[]
[]
[]
[]
[]
[]
[]
[]
[]
[]
[]
[]
[]
[]
[]
[]
[]
[]
[]
[null,"Technical "]
{"$rows_left_out":178}
{"sheet":"Dropdown list","index":14,"n_rows":58,"n_cols":10,"rows_kept":58,"cut":false,"hidden":true,"merged":[]}
[]
["If you add something to the table, the conditional format will have to be updated as it does not recognize the table name. The dropdown list will be updated automatically. "]
[]
[]
[null,"Solvents","Status ","€/ton","kg CO2eq/kg",null,null,"Critical Raw Materials included in catalysts","Status","€/ton"]
[null,"1,4-dioxane",3,2000,null,null,null,"Aluminium",1,1600]
[null,"Ac2O",2,750,null,null,null,"Antimony",3,7200]
[null,"Acetone",2,900,null,null,null,"Arsenic",3,2000]
[null,"Acetonitrile",2,3200,null,null,null,"Baryte",3,150]
[null,"AcOH",2,800,null,null,null,"Bauxite",3,42]
[null,"Anisole",1,4200,null,null,null,"Beryllium",3,500000]
[null,"Benzene",3,750,null,null,null,"Bismuth",3,6]
[null,"Benzyl alcohol",2,2800,null,null,null,"Borate",3,300]
[null,"BuOH",2,1000,null,null,null,"Cadmium ",1,4500]
[null,"CCl4",3,800,null,null,null,"Chromium",1,10000]
[null,"Chlorobenzene",2,950,null,null,null,"Cobalt",3,40000]
[null,"Chloroform",3,950,null,null,null,"Coking coal",3,160]
[null,"Cyclohexane",3,900,null,null,null,"Copper",3,8500]
[null,"Cyclohexanone",1,1200,null,null,null,"Fluorspar",3,400]
[null,"DCE",3,400,null,null,null,"Gallium",3,250000]
[null,"DCM",3,310,null,null,null,"Germanium",3,1300000]
[null,"Diethyl ether",3,2800,null,null,null,"Gold",1,60000000]
[null,"Diisopropyl ether",3,3120,null,null,null,"Hafnium",3,1000000]
[null,"DMAc",3,null,null,null,null,"Heavy rare earth elements",3]
[null,"DME",3,500,null,null,null,"Helium ",3]
[null,"DMF",3,800,null,null,null,"Indium",3,210000]
[null,"DMPU",2,null,null,null,null,"Lead",1,2100]
[null,"DMSO",2,2700,null,null,null,"Light rare earth elements",3]
[null,"DMC",null,1000,null,null,null,"Lithium",3,40000]
[null,"Ethylene glycol",2,650,null,null,null,"Magnesium",3,2300]
{"$rows_left_out":28}