{"text_format":"1","workbook":"xlsx","n_sheets":16,"sheets":["Intro","Dashboard results","Project","Technology","Market ","Pathway definition and results","Data - technical","CB_DATA_","Data - economic","Data - environmental","Data - general","1. Pathway 1","2. Pathway 2","3. Pathway 3","4. Pathway 4","Dropdown list"],"not_rendered":{"charts":9,"images":25,"macros":1,"external_links":1,"defined_names":71,"comments":10,"pivot_tables":0},"unopened":[],"bounds":{"document_bytes":16777216,"sheet_cells":100000,"rows_first":2000,"rows_last":500,"rows_between":2000,"halvings":0,"cell_chars":16384,"cell_head_chars":4096},"cells_cut":0,"cells_raw":0,"read":"whole","date_system":"1900"}

{"sheet":"Intro","index":0,"n_rows":54,"n_cols":4,"rows_kept":54,"cut":false,"hidden":false,"merged":[[12,1,12,23],[9,1,9,10],[47,1,47,11],[6,1,6,8],[53,1,53,14]]}
[]
[]
[]
[]
[null,"Introduction "]
[]
[null,"This example template is solely made to demonstrate how the Excel template works using a simplified example. The results from the analysis should therefore not be used to make conclusions on the economic feasibility, nor the environmental impact of the case study. The simplified case study does not follow all the methodological guidelines as its only goal is to showcase how the Excel template works.   "]
[]
[null,"Background and purpose of the template "]
[null,"The goal of the Moonshot program is to support projects that aim at providing solutions that help the (chemical) industry in Flanders to become CO2 neutral by 2050. \n\nThe goal of this template is to provide guidance in the valorisation and sustainability assessment of Moonshot projects taking the overall Moonshot objective and specific MOT KPIs into account. \n\nThe template and guidelines are based on principles of TEA and LCA, however, are too limited to be used as a full TEA and LCA. The template is obliged during the execution of the approved Moonshot projects and is one of the deliverables that need to be submitted to Vlaio. Mid-term the project, a meeting with the advisory board members needs to be organized to discuss the results of the sustainability assessment. \n\nThe goals are the following: \nI.\tTo have a substantiated estimate of the economic and climate change impacts with the aim to identify the hot-spots (i.e. understand where the impact is coming from) and with these to update research targets from the proposal phase and define the next steps towards implementation (i.e. technology roadmap and follow-up trajectory); \nII.\tTo compare the economic and climate change impact with state-of-the-art and emerging technologies; \nIII.\tTo understand the contribution of a project to the specific MOT goals and KPIs;\nIV.\tTo specify what is required for a successful implementation. \n\nDetailed guidelines are available in the document titled \"methodological framework for the sustainability assessment of MOONSHOT initiatives\"."]
[]
[null,"Template developers"]
[null,"The template and framework are developed by a consortium led by VITO and subcontractors Deloitte, Antwerp University, KU Leuven and Ghent University. \nThe template and accompanying sustainability framework are commissioned by Vlaio. "]
[]
[null,"Contact information"]
[null,"For questions related to the template, please use one of the following e-mail addresses: "]
[null,"- Helpdesk - moonshot.sustainabilityframework@vito.be"]
[null,"- Catalisti - moonshot@catalisti.be"]
[]
[null,"Legend"]
{"$rows_left_out":35}
{"sheet":"Dashboard results","index":1,"n_rows":128,"n_cols":11,"rows_kept":128,"cut":false,"hidden":false,"merged":[[107,3,111,3],[115,3,119,3],[21,2,21,3],[40,2,40,3],[79,3,83,3],[87,3,91,3],[42,3,46,3],[50,3,55,3],[1,2,1,13],[3,2,3,3],[5,5,5,7],[7,5,7,7],[9,5,9,7],[113,5,113,7],[107,5,111,7],[115,5,119,7],[11,5,11,7],[11,10,14,12],[13,5,13,7],[15,5,15,7],[17,5,17,7],[79,5,83,7],[85,5,85,7],[87,5,91,7],[48,10,48,12],[42,10,46,12],[50,10,55,12]]}
[]
[null,null,"Disclaimer: This dashboard displays an overview of important data, each time referring to the different input worksheets. Data should not be entered in this worksheet by the registrants."]
[]
[null,null,"General project information"]
[]
[null,null,null,{"$f":"Project!$B$6","v":"Project acronym"},null,{"$f":"IF(Project!$C$6=0,\"\",Project!$C$6)","v":"e.g."},null,null,null,{"$f":"Technology!$B$6","v":"Targeted product(s)"},{"$f":"IF(Technology!$C$6=0,\"\",Technology!$C$6)","v":"Hydrogen"}]
[]
[null,null,null,{"$f":"Project!$B$9","v":"Start date"},null,{"$f":"IF(Project!$C$9=0,\"\",Project!$C$9)","v":"2023-05-01"},null,null,null,{"$f":"Technology!$B$11","v":"Current TRL "},{"$f":"IF(Technology!$C$11=0,\"\",Technology!$C$11)","v":7}]
[]
[null,null,null,{"$f":"Project!$B$10","v":"Project duration (months)"},null,{"$f":"IF(Project!$C$10=0,\"\",Project!$C$10)","v":10},null,null,null,{"$f":"Technology!$B$32","v":"Functional unit (FU)"},{"$f":"IF(Technology!$C$32=0,\"\",Technology!$C$32)","v":"ton H2"}]
[]
[null,null,null,{"$f":"Project!$B$11","v":"Total budget (€)"},null,{"$f":"IF(Project!$C$11=0,\"\",Project!$C$11)","v":3000000},null,null,null,{"$f":"Technology!$B$8","v":"Process description"},{"$f":"IF(Technology!$B$9=0,\"\",Technology!$B$9)","v":"Hydrogen is produced via a water electrolyzer (alkaline or PEM). Electricity is used to split water into hydrogen and oxygen. "}]
[]
[null,null,null,{"$f":"Project!$B$12","v":"Total number of person-months"},null,{"$f":"IF(Project!$C$12=0,\"\",Project!$C$12)","v":10}]
[]
[null,null,null,{"$f":"Project!$B$13","v":"Lead partner (coordinator)"},null,{"$f":"IF(Project!$C$13=0,\"\",Project!$C$13)","v":"VITO"}]
[null,null,null,null,null,null,null,null,null,{"$f":"Technology!$B$23","v":"Geographical scope"},{"$f":"IF(Technology!$C$23=0,\"\",Technology!$C$23)","v":"Flanders"}]
[null,null,null,{"$f":"Project!$B$14","v":"Other consortium partners"},null,{"$f":"IF(Project!$C$14=0,\"\",Project!$C$14)","v":"Deloitte, UGent, UA, KUL"}]
[]
[]
{"$rows_left_out":109}
{"sheet":"Project","index":2,"n_rows":20,"n_cols":3,"rows_kept":20,"cut":false,"hidden":false,"merged":[]}
[]
[]
[]
[null,"Project sheet"]
[]
[null,"Project acronym","e.g."]
[null,"Full title","Example template"]
[null,"Project number","-"]
[null,"Start date","2023-05-01"]
[null,"Project duration (months)",10]
[null,"Total budget (€)",3000000]
[null,"Total number of person-months",10]
[null,"Lead partner (coordinator)","VITO"]
[null,"Other consortium partners","Deloitte, UGent, UA, KUL"]
[null,"Contact information coordinator","moonshot.sustainabilityframework@vito.be"]
[]
[]
[null,"Version "]
[null,"Date"]
[null,"2023-05-01"]
{"$rows_left_out":1}
{"sheet":"Technology","index":3,"n_rows":39,"n_cols":8,"rows_kept":39,"cut":false,"hidden":false,"merged":[[38,1,38,10],[34,1,34,10],[29,2,29,10],[31,2,31,10],[5,2,5,10],[8,1,8,10],[10,2,10,10],[22,2,22,10],[24,2,24,10],[20,1,20,10],[13,4,13,6],[14,7,14,10],[15,7,15,10],[16,7,16,10],[14,4,14,6],[13,7,13,10],[15,4,15,6],[16,4,16,6]]}
[]
[]
[]
[null,"Technology description "]
[]
[null,"Targeted product(s)","Hydrogen"]
[]
[null,"Process description"]
[null,"Hydrogen is produced via a water electrolyzer (alkaline or PEM). Electricity is used to split water into hydrogen and oxygen. "]
[]
[null,"Current TRL ",7]
[]
[null,"Benchmark technologies"]
[null,"Benchmark process","TRL","Climate change impact (ton CO2eq/FU)","Description",null,null,"Position of new technology compared to benchmark process"]
[null,"Steam reforming of methane",9,11.2]
[]
[]
[]
[null,"Purpose of the sustainability assessment"]
[null,"Describe the specific purpose that you have defined for the sustainability impact calculation. "]
{"$rows_left_out":20}
{"sheet":"Market ","index":4,"n_rows":38,"n_cols":3,"rows_kept":38,"cut":false,"hidden":false,"merged":[[6,3,6,9],[20,3,20,9]]}
[]
[]
[]
[null,"Market description "]
[]
[null,"How does the current market of your targeted product look like? "]
[null,"Targeted product 1","Hydrogen"]
[null,"Global production (ton/yr)"]
[null,"Belgian production (ton/yr)"]
[null,"Global demand (ton/yr) "]
[null,"Targeted market share "]
[null,"CAGR (%)"]
[null,"Main market players"]
[null,"Main market players Flanders"]
[null,"Price (€/ton)"]
[null,"Main application(s)"]
[null,"Targeted application(s)"]
[null,"Main production technology"]
[null,"Varia"]
[]
{"$rows_left_out":19}
{"sheet":"Pathway definition and results","index":5,"n_rows":86,"n_cols":8,"rows_kept":86,"cut":false,"hidden":false,"merged":[[2,2,2,3],[11,2,11,3],[18,2,18,3],[32,2,32,3],[74,2,74,9],[78,2,78,9],[82,2,82,9],[86,2,86,9],[4,3,4,9],[5,3,5,9],[6,3,6,9],[7,3,7,9],[70,2,70,9]]}
[]
[]
[null,null,"Pathway definition and results"]
[]
[null,null,"Pathway 1 ","Hydrogen production using a water electrolyser"]
[null,null,"Pathway 2"]
[null,null,"Pathway 3"]
[null,null,"Pathway 4 "]
[]
[]
[]
[null,null,"Scale"]
[null,null,"Parameter","Unit",{"$f":"\"1.\" & \" \" & C5","v":"1. Pathway 1 "},{"$f":"\"2.\" & \" \" & C6","v":"2. Pathway 2"},{"$f":"\"3.\" & \" \" & C7","v":"3. Pathway 3"},{"$f":"\"4.\" & \" \" & C8","v":"4. Pathway 4 "}]
[null,null,"Electricity input ","MWh/yr",55000]
[null,null,"Installed capacity","MW",20]
[]
[]
[]
[null,null,"What-if parameter"]
[null,null,"Parameter",null,{"$f":"E13","v":"1. Pathway 1 "},{"$f":"F13","v":"2. Pathway 2"},{"$f":"G13","v":"3. Pathway 3"},{"$f":"H13","v":"4. Pathway 4 "}]
{"$rows_left_out":67}
{"sheet":"Data - technical","index":6,"n_rows":66,"n_cols":12,"rows_kept":66,"cut":false,"hidden":false,"merged":[]}
[]
[]
[]
[null,"Technical data inventory"]
[]
[]
[]
[null,null,null,"Parameter","Unit","Indicative value","Range","Data type",{"$f":"'Pathway definition and results'!E13","v":"1. Pathway 1 "},{"$f":"'Pathway definition and results'!F13","v":"2. Pathway 2"},{"$f":"'Pathway definition and results'!G13","v":"3. Pathway 3"},{"$f":"'Pathway definition and results'!H13","v":"4. Pathway 4 "}]
[null,"Raw material extraction/feedstock"]
[null,"Feedstock x ","Mass In","Electricity ","MWh/yr"]
[]
[]
[]
[]
[null,"Processing"]
[null,"Electrolyser (PEM)","Mass In","Water use","L/m³ H2",1.5,null,2,1.5]
[null,null,"Mass Out","Oxygen production","Nm³/kWh",0.1,null,5,0.1]
[null,null,null,"Waste water","L/Nm³ H2",0.5,null,5,0.5]
[null,null,null,"Cooling water use","m³/Nm³ H2"]
[null,null,"Energy","Electricity use","kWh/m³ H2",4.9000000000000004,null,2,4.9000000000000004]
{"$rows_left_out":47}
{"sheet":"CB_DATA_","index":7,"n_rows":31,"n_cols":3,"rows_kept":31,"cut":false,"hidden":true,"merged":[]}
["Crystal Ball Data"]
[]
["Workbook Variables","Last Var Column",0]
["    Name:"]
["    Value:"]
[]
["Worksheet Data","Last Data Column Used"]
[null,3]
[]
["Sheet Ref"]
[{"$f":"CB_DATA_!#REF!","v":{"$error":"#REF!"}},{"$f":"'Data - technical'!#REF!","v":{"$error":"#REF!"}},{"$f":"'1. Pathway 1'!#REF!","v":{"$error":"#REF!"}}]
[]
["Sheet Guid"]
["53986a65-f770-4a51-8b77-73507703699a","591af63a-a786-40c3-acbe-8924f4d9752f","2064e1ed-4ab9-43f2-92b5-2f722344881e"]
[]
["Deleted sheet count"]
[]
[]
["Last row used"]
[31,31,31]
{"$rows_left_out":12}
{"sheet":"Data - economic","index":8,"n_rows":112,"n_cols":12,"rows_kept":112,"cut":false,"hidden":false,"merged":[]}
[]
[]
[]
[null,"Economic data inventory"]
[]
[]
[]
[null,null,null,"Parameter","Unit","Indicative value","Range","Data type",{"$f":"'Pathway definition and results'!E13","v":"1. Pathway 1 "},{"$f":"'Pathway definition and results'!F13","v":"2. Pathway 2"},{"$f":"'Pathway definition and results'!G13","v":"3. Pathway 3"},{"$f":"'Pathway definition and results'!H13","v":"4. Pathway 4 "}]
[null,"Financial"]
[null,null,null,"Nominal discount rate","%",0.25,"10-30",6]
[null,null,null,"Real discount rate","%",{"$f":"(F10-F15)/(1+F15)","v":0.22549019607843138}]
[null,null,null,"Equity (EV)","%",0.2,null,6]
[null,null,null,"Debt (VV)","%",{"$f":"1-F12","v":0.8}]
[null,null,null,"Intrest rate (loan)","%",0.05,null,6]
[null,null,null,"Inflation rate","%",0.02,null,6]
[null,null,null,"WACC","%",{"$f":"(F11*F12)+(F13*(1-F17)*F14)","v":7.509803921568628E-2}]
[null,null,null,"Corporate tax rate Belgium","%",0.25,null,6]
[null,null,null,"Economic Lifetime/Evaluation period","yr",15,"10-20",6]
[null,"General capital costs"]
[null,null,"Lang factor","Solid processing plant","-",4,"-",6]
{"$rows_left_out":93}
{"sheet":"Data - environmental","index":9,"n_rows":67,"n_cols":12,"rows_kept":67,"cut":false,"hidden":false,"merged":[]}
[]
[]
[]
[null,"Environmental data inventory"]
[]
[]
[]
[null,null,null,"Parameter","Unit","Indicative value","Range","Data type",{"$f":"'Pathway definition and results'!E13","v":"1. Pathway 1 "},{"$f":"'Pathway definition and results'!F13","v":"2. Pathway 2"},{"$f":"'Pathway definition and results'!G13","v":"3. Pathway 3"},{"$f":"'Pathway definition and results'!H13","v":"4. Pathway 4 "}]
[null,"Characterization factors"]
[null,"Greenhouse gases (GHG)",null,"CO2 (fossil-origin)","kg CO2eq/kg CO2",1,"-",6]
[null,null,null,"CO2 (biogenic origin)","kg CO2eq/kg CO2",0,"-",6]
[null,null,null,"CH4 ","kg CO2eq/kg CH4",28,"25-34",6]
[null,null,null,"N2O","kg CO2eq/kg N2O",265,"-",6]
[null,null,null,"HCFC-141b","kg CO2eq/kg HCFC-141b",782,"-",6]
[null,null,null,"HFC-134a","kg CO2eq/kg HFC-134a",1300,"-",6]
[null,null,null,"HCFC-22","kg CO2eq/kg HCFC-22",1760,"-",6]
[null,null,null,"HCFC-142b","kg CO2eq/kg HCFC-142b",1980,"-",6]
[null,null,null,"CFC-11","kg CO2eq/kg CFC-11",4660,"-",6]
[null,null,null,"CFC-12","kg CO2eq/kg CFC-12",10200,"-",6]
[null,null,null,"SF6","kg CO2eq/kg SF6",23500,"-",6]
{"$rows_left_out":48}
{"sheet":"Data - general","index":10,"n_rows":77,"n_cols":4,"rows_kept":77,"cut":false,"hidden":false,"merged":[]}
[]
[]
[]
[null,"General data"]
[]
[]
[]
[null,"CEPCI"]
[]
[null,null,"Year","CEPCI"]
[null,null,2013,567.29999999999995]
[null,null,2014,576.1]
[null,null,2015,556.79999999999995]
[null,null,2016,541.70000000000005]
[null,null,2017,567.5]
[null,null,2018,603.1]
[null,null,2019,607.5]
[null,null,2020,596.20000000000005]
[null,null,2021,708]
[null,null,2022,816]
{"$rows_left_out":58}
{"sheet":"1. Pathway 1","index":11,"n_rows":319,"n_cols":35,"rows_kept":319,"cut":false,"hidden":false,"merged":[[22,8,22,9],[23,8,23,9],[21,8,21,9],[79,4,79,34]]}
[]
[]
[]
[null,{"$f":"'Pathway definition and results'!E13","v":"1. Pathway 1 "}]
[]
[null,"PFD"]
[]
[]
[]
[null,null,null,null,null,null,null,null,null,null,null,null,"Electrolyser",{"$f":"IF('Pathway definition and results'!E23=0,\"PEM Electrolyser\",\"Alkaline Electrolyser\") & CHAR(10) & CHAR(10) & \"Installed power:\" & \" \" & IF('Pathway definition and results'!E23=1,ROUNDUP('1. Pathway 1'!E42,0),ROUNDUP('1. Pathway 1'!E27,0)) & \" \" & F27 & CHAR(10) & \"Pressure: \" & IF('Pathway definition and results'!E23=1,ROUNDUP('Data - technical'!I39,0),ROUNDUP('Data - technical'!I23,0)) & \" \" &'Data - technical'!E23","v":"PEM Electrolyser\n\nInstalled power: 7 MW\nPressure: 30 bar"}]
[null,null,null,null,null,null,null,null,null,null,null,null,"Electricity",{"$f":"\"Electricity: \" & IF('Pathway definition and results'!E23=1,ROUNDUP('1. Pathway 1'!E40,0),ROUNDUP('1. Pathway 1'!E25,0)) & \" \" & '1. Pathway 1'!F25","v":"Electricity: 55000 MWh/yr"}]
[null,null,null,null,null,null,null,null,null,null,null,null,"Water",{"$f":"\"Water: \" & IF('Pathway definition and results'!E23=1,ROUNDUP('1. Pathway 1'!E45,0),ROUNDUP('1. Pathway 1'!E30,0)) & \" \" & '1. Pathway 1'!F30","v":"Water: 16837 m³/yr"}]
[null,null,null,null,null,null,null,null,null,null,null,null,"Hydrogen",{"$f":"\"Hydrogen: \"&IF('Pathway definition and results'!E23=1,ROUNDUP(E47/1000000,1),ROUNDUP(E32/1000000,1))&\" \"& \"million\" & \" \" & F32","v":"Hydrogen: 11.3 million m³/yr"}]
[null,null,null,null,null,null,null,null,null,null,null,null,"Oxygen",{"$f":"\"Oxygen: \"&IF('Pathway definition and results'!E23=1,ROUNDUP('1. Pathway 1'!E50/1000000,1),ROUNDUP('1. Pathway 1'!E35/1000000,1))&\" \"& \"million\" & \" \" & '1. Pathway 1'!F35","v":"Oxygen: 5.5 million m³/yr"}]
[null,null,null,null,null,null,null,null,null,null,null,null,"Waste water",{"$f":"\"Waste water: \" & IF('Pathway definition and results'!E23=1,ROUNDUP('1. Pathway 1'!E52,0),ROUNDUP('1. Pathway 1'!E37,0)) & \" \" & '1. Pathway 1'!F37","v":"Waste water: 5613 m³/yr"}]
[]
[null,null,null,null,null,null,null,null,null,null,null,null,"Compressor",{"$f":"\"H2 compressor\" & CHAR(10) & CHAR(10) & \"Pressure: \" & ROUNDUP('Data - technical'!I51,0) & \" \" & 'Data - technical'!E51","v":"H2 compressor\n\nPressure: 200 bar"}]
[null,null,null,null,null,null,null,null,null,null,null,null,"Electricity",{"$f":"\"Electricity: \" & ROUNDUP(E58,0) & \" \" & F58","v":"Electricity: 3996 MWh/yr"}]
[]
[null,null,null,null,null,null,null,null,null,null,null,null,"Storage",{"$f":"\"H2 storage\" & CHAR(10) & CHAR(10) & \"Storage size: \" & ROUNDUP('Data - technical'!I59,0) & \" \" & 'Data - technical'!J59 & CHAR(10) & \"Storage capacity: \" & ROUNDUP('1. Pathway 1'!E64,0) & \" \" & '1. Pathway 1'!F64","v":"H2 storage\n\nStorage size: 24 \nStorage capacity: 2997 kg"}]
{"$rows_left_out":300}
{"sheet":"2. Pathway 2","index":12,"n_rows":207,"n_cols":35,"rows_kept":207,"cut":false,"hidden":true,"merged":[[77,4,77,34]]}
[]
[]
[]
[null,{"$f":"'Pathway definition and results'!F13","v":"2. Pathway 2"}]
[]
[null,"PFD"]
[]
[]
[]
[]
[]
[]
[]
[]
[]
[]
[]
[]
[]
[]
{"$rows_left_out":188}
{"sheet":"3. Pathway 3","index":13,"n_rows":207,"n_cols":35,"rows_kept":207,"cut":false,"hidden":true,"merged":[[77,4,77,34]]}
[]
[]
[]
[null,{"$f":"'Pathway definition and results'!G13","v":"3. Pathway 3"}]
[]
[null,"PFD"]
[]
[]
[]
[]
[]
[]
[]
[]
[]
[]
[]
[]
[]
[]
{"$rows_left_out":188}
{"sheet":"4. Pathway 4","index":14,"n_rows":207,"n_cols":35,"rows_kept":207,"cut":false,"hidden":true,"merged":[[77,4,77,34]]}
[]
[]
[]
[null,{"$f":"'Pathway definition and results'!H13","v":"4. Pathway 4 "}]
[]
[null,"PFD"]
[]
[]
[]
[]
[]
[]
[]
[]
[]
[]
[]
[]
[]
[]
{"$rows_left_out":188}
{"sheet":"Dropdown list","index":15,"n_rows":58,"n_cols":10,"rows_kept":58,"cut":false,"hidden":true,"merged":[]}
[]
["If you add something to the table, the conditional format will have to be updated as it does not recognize the table name. The dropdown list will be updated automatically. "]
[]
[]
[null,"Solvents","Status ","€/ton","kg CO2eq/kg",null,null,"Critical Raw Materials included in catalysts","Status","€/ton"]
[null,"1,4-dioxane",3,2000,null,null,null,"Aluminium",1,1600]
[null,"Ac2O",2,750,null,null,null,"Antimony",3,7200]
[null,"Acetone",2,900,null,null,null,"Arsenic",3,2000]
[null,"Acetonitrile",2,3200,null,null,null,"Baryte",3,150]
[null,"AcOH",2,800,null,null,null,"Bauxite",3,42]
[null,"Anisole",1,4200,null,null,null,"Beryllium",3,500000]
[null,"Benzene",3,750,null,null,null,"Bismuth",3,6]
[null,"Benzyl alcohol",2,2800,null,null,null,"Borate",3,300]
[null,"BuOH",2,1000,null,null,null,"Cadmium ",1,4500]
[null,"CCl4",3,800,null,null,null,"Chromium",1,10000]
[null,"Chlorobenzene",2,950,null,null,null,"Cobalt",3,40000]
[null,"Chloroform",3,950,null,null,null,"Coking coal",3,160]
[null,"Cyclohexane",3,900,null,null,null,"Copper",3,8500]
[null,"Cyclohexanone",1,1200,null,null,null,"Fluorspar",3,400]
[null,"DCE",3,400,null,null,null,"Gallium",3,250000]
{"$rows_left_out":38}